Skip to content

Bump io.github.fornewid:placeholder-material3 from 1.0.1 to 2.0.0 #287

Bump io.github.fornewid:placeholder-material3 from 1.0.1 to 2.0.0

Bump io.github.fornewid:placeholder-material3 from 1.0.1 to 2.0.0 #287

Triggered via pull request November 21, 2024 09:34
Status Success
Total duration 7m 26s
Artifacts

unit-test.yml

on: pull_request
Fit to window
Zoom out
Zoom in

Annotations

3 errors and 1 warning
de.tum.informatics.www1.artemis.native_app.feature.metis.manageconversations.members.ConversationMemberSettingsE2eTest ► can promote user to moderator: feature/metis/manage-conversations/src/test/kotlin/de/tum/informatics/www1/artemis/native_app/feature/metis/manageconversations/members/ConversationMemberSettingsE2eTest.kt#L195
Failed test found in: test-outputs/manage-conversations/testProductionTumReleaseUnitTest/TEST-de.tum.informatics.www1.artemis.native_app.feature.metis.manageconversations.members.ConversationMemberSettingsE2eTest.xml Error: androidx.compose.ui.test.ComposeTimeoutException: Condition still not satisfied after 10000 ms
de.tum.informatics.www1.artemis.native_app.feature.metis.manageconversations.members.ConversationMemberSettingsE2eTest ► displays conversation members: feature/metis/manage-conversations/src/test/kotlin/de/tum/informatics/www1/artemis/native_app/feature/metis/manageconversations/members/ConversationMemberSettingsE2eTest.kt#L86
Failed test found in: test-outputs/manage-conversations/testProductionTumReleaseUnitTest/TEST-de.tum.informatics.www1.artemis.native_app.feature.metis.manageconversations.members.ConversationMemberSettingsE2eTest.xml Error: java.lang.AssertionError: Failed to assert the following: ((hasAnyDescendantThat(Text + EditableText contains 'aa01aaa' (ignoreCase: false))) && (hasAnyDescendantThat(ContentDescription = 'Moderator' (ignoreCase: false))))
de.tum.informatics.www1.artemis.native_app.feature.quiz.QuizPracticeParticipationE2eTest ► can submit practice quiz - multiple choice: core/core-test/src/main/kotlin/de/tum/informatics/www1/artemis/native_app/core/test/BaseComposeTest.kt#L26
Failed test found in: test-outputs/quiz/testProductionTumReleaseUnitTest/TEST-de.tum.informatics.www1.artemis.native_app.feature.quiz.QuizPracticeParticipationE2eTest.xml Error: kotlinx.coroutines.TimeoutCancellationException: Timed out waiting for 10000 ms
JUnit Tests
The following actions use a deprecated Node.js version and will be forced to run on node20: gradle/wrapper-validation-action@v1, actions/setup-java@v3. For more info: https://github.blog/changelog/2024-03-07-github-actions-all-actions-will-run-on-node20-instead-of-node16-by-default/