Chore
: Re-update to serialization based navigation
#202
Annotations
11 errors and 1 warning
de.tum.informatics.www1.artemis.native_app.feature.metis.conversation.ConversationAnswerMessagesUITest ► test GIVEN post is not resolved WHEN resolving the post THEN the post is resolved with the third answer post:
feature/metis/conversation/src/test/kotlin/de/tum/informatics/www1/artemis/native_app/feature/metis/conversation/ConversationAnswerMessagesUITest.kt#L130
Failed test found in:
test-outputs/conversation/testProductionTumReleaseUnitTest/TEST-de.tum.informatics.www1.artemis.native_app.feature.metis.conversation.ConversationAnswerMessagesUITest.xml
Error:
java.lang.AssertionError: Assertion failed
|
de.tum.informatics.www1.artemis.native_app.feature.metis.conversation.ConversationAnswerMessagesUITest ► test GIVEN post is not resolved WHEN resolving the post THEN the post is resolved with the first answer post:
feature/metis/conversation/src/test/kotlin/de/tum/informatics/www1/artemis/native_app/feature/metis/conversation/ConversationAnswerMessagesUITest.kt#L112
Failed test found in:
test-outputs/conversation/testProductionTumReleaseUnitTest/TEST-de.tum.informatics.www1.artemis.native_app.feature.metis.conversation.ConversationAnswerMessagesUITest.xml
Error:
java.lang.AssertionError: Assertion failed
|
de.tum.informatics.www1.artemis.native_app.feature.metis.conversation.ConversationAnswerMessagesUITest ► test GIVEN post is resolved WHEN un-resolving the post THEN the post is un-resolved:
feature/metis/conversation/src/test/kotlin/de/tum/informatics/www1/artemis/native_app/feature/metis/conversation/ConversationAnswerMessagesUITest.kt#L158
Failed test found in:
test-outputs/conversation/testProductionTumReleaseUnitTest/TEST-de.tum.informatics.www1.artemis.native_app.feature.metis.conversation.ConversationAnswerMessagesUITest.xml
Error:
java.lang.AssertionError: Assertion failed
|
de.tum.informatics.www1.artemis.native_app.feature.metis.manageconversations.members.ConversationMemberSettingsE2eTest ► can promote user to moderator:
feature/metis/manage-conversations/src/test/kotlin/de/tum/informatics/www1/artemis/native_app/feature/metis/manageconversations/members/ConversationMemberSettingsE2eTest.kt#L195
Failed test found in:
test-outputs/manage-conversations/testProductionTumReleaseUnitTest/TEST-de.tum.informatics.www1.artemis.native_app.feature.metis.manageconversations.members.ConversationMemberSettingsE2eTest.xml
Error:
androidx.compose.ui.test.ComposeTimeoutException: Condition (exactly 1 nodes match ((TestTag = 'memberaa02aaa') && (hasAnyDescendantThat(ContentDescription = 'Moderator' (ignoreCase: false))))) still not satisfied after 10000 ms
|
de.tum.informatics.www1.artemis.native_app.feature.metis.manageconversations.members.ConversationMemberSettingsE2eTest ► displays conversation members:
feature/metis/manage-conversations/src/test/kotlin/de/tum/informatics/www1/artemis/native_app/feature/metis/manageconversations/members/ConversationMemberSettingsE2eTest.kt#L86
Failed test found in:
test-outputs/manage-conversations/testProductionTumReleaseUnitTest/TEST-de.tum.informatics.www1.artemis.native_app.feature.metis.manageconversations.members.ConversationMemberSettingsE2eTest.xml
Error:
java.lang.AssertionError: Failed to assert the following: ((hasAnyDescendantThat(Text + EditableText contains 'aa01aaa' (ignoreCase: false))) && (hasAnyDescendantThat(ContentDescription = 'Moderator' (ignoreCase: false))))
|
E2E Tests
Process completed with exit code 1.
|
E2E Tests
Failed test were found and 'fail-on-error' option is set to true
|
E2E Tests
Process completed with exit code 1.
|
E2E Tests
Process completed with exit code 1.
|
E2E Tests
Process completed with exit code 1.
|
E2E Tests
Process completed with exit code 1.
|
E2E Tests
The following actions use a deprecated Node.js version and will be forced to run on node20: gradle/wrapper-validation-action@v1, actions/setup-java@v3. For more info: https://github.blog/changelog/2024-03-07-github-actions-all-actions-will-run-on-node20-instead-of-node16-by-default/
|