Skip to content

Instructions to install JAR file for kafka sink connector #874

Instructions to install JAR file for kafka sink connector

Instructions to install JAR file for kafka sink connector #874

GitHub Actions / JUnit Test Report failed Oct 23, 2024 in 0s

125 tests run, 82 passed, 11 skipped, 32 failed.

Annotations

Check failure on line 103 in sink-connector-lightweight/src/test/java/com/altinity/clickhouse/debezium/embedded/ClickHouseDebeziumEmbeddedPostgresDecoderBufsDockerIT.java

See this annotation in the file changed.

@github-actions github-actions / JUnit Test Report

ClickHouseDebeziumEmbeddedPostgresDecoderBufsDockerIT.testDecoderBufsPlugin

java.lang.AssertionError
	at com.altinity.clickhouse.debezium.embedded.ClickHouseDebeziumEmbeddedPostgresDecoderBufsDockerIT.testDecoderBufsPlugin(ClickHouseDebeziumEmbeddedPostgresDecoderBufsDockerIT.java:103)
Raw output
java.lang.AssertionError
	at com.altinity.clickhouse.debezium.embedded.ClickHouseDebeziumEmbeddedPostgresDecoderBufsDockerIT.testDecoderBufsPlugin(ClickHouseDebeziumEmbeddedPostgresDecoderBufsDockerIT.java:103)

Check failure on line 106 in sink-connector-lightweight/src/test/java/com/altinity/clickhouse/debezium/embedded/ClickHouseDebeziumEmbeddedPostgresPgoutputDockerIT.java

See this annotation in the file changed.

@github-actions github-actions / JUnit Test Report

ClickHouseDebeziumEmbeddedPostgresPgoutputDockerIT.testPgOutputPlugin

java.lang.AssertionError
	at com.altinity.clickhouse.debezium.embedded.ClickHouseDebeziumEmbeddedPostgresPgoutputDockerIT.testPgOutputPlugin(ClickHouseDebeziumEmbeddedPostgresPgoutputDockerIT.java:106)
Raw output
java.lang.AssertionError
	at com.altinity.clickhouse.debezium.embedded.ClickHouseDebeziumEmbeddedPostgresPgoutputDockerIT.testPgOutputPlugin(ClickHouseDebeziumEmbeddedPostgresPgoutputDockerIT.java:106)

Check failure on line 54 in sink-connector-lightweight/src/test/java/com/altinity/clickhouse/debezium/embedded/MariaDBIT.java

See this annotation in the file changed.

@github-actions github-actions / JUnit Test Report

MariaDBIT.testMultipleDatabases

Container startup failed for image mariadb:10.3.6
Raw output
org.testcontainers.containers.ContainerLaunchException: Container startup failed for image mariadb:10.3.6
	at com.altinity.clickhouse.debezium.embedded.MariaDBIT.startContainers(MariaDBIT.java:54)
Caused by: org.rnorth.ducttape.RetryCountExceededException: Retry limit hit with exception
	at com.altinity.clickhouse.debezium.embedded.MariaDBIT.startContainers(MariaDBIT.java:54)
Caused by: org.testcontainers.containers.ContainerLaunchException: Could not create/start container
	at com.altinity.clickhouse.debezium.embedded.MariaDBIT.startContainers(MariaDBIT.java:54)
Caused by: org.testcontainers.containers.JdbcDatabaseContainer$NoDriverFoundException: Could not get Driver
	at com.altinity.clickhouse.debezium.embedded.MariaDBIT.startContainers(MariaDBIT.java:54)
Caused by: java.lang.ClassNotFoundException: org.mariadb.jdbc.Driver
	at com.altinity.clickhouse.debezium.embedded.MariaDBIT.startContainers(MariaDBIT.java:54)

Check failure on line 109 in sink-connector-lightweight/src/test/java/com/altinity/clickhouse/debezium/embedded/MySQLGenerateColumnsTest.java

See this annotation in the file changed.

@github-actions github-actions / JUnit Test Report

MySQLGenerateColumnsTest.testMySQLGeneratedColumns

Cannot invoke "String.equalsIgnoreCase(String)" because the return value of "java.util.Map.get(Object)" is null
Raw output
java.lang.NullPointerException: Cannot invoke "String.equalsIgnoreCase(String)" because the return value of "java.util.Map.get(Object)" is null
	at com.altinity.clickhouse.debezium.embedded.MySQLGenerateColumnsTest.testMySQLGeneratedColumns(MySQLGenerateColumnsTest.java:109)

Check failure on line 132 in sink-connector-lightweight/src/test/java/com/altinity/clickhouse/debezium/embedded/MySQLJsonIT.java

See this annotation in the file changed.

@github-actions github-actions / JUnit Test Report

MySQLJsonIT.testMultipleDatabases

Code: 60. DB::Exception: Unknown table expression identifier 'employees.audience' in scope SELECT * FROM employees.audience. (UNKNOWN_TABLE) (version 24.9.2.42 (official build))
, server ClickHouseNode [uri=http://localhost:32841/system, options={custom_settings=allow_experimental_object_type=1,insert_allow_materialized_columns=1,client_name=Client_1}]@2037727223
Raw output
java.sql.BatchUpdateException: 
Code: 60. DB::Exception: Unknown table expression identifier 'employees.audience' in scope SELECT * FROM employees.audience. (UNKNOWN_TABLE) (version 24.9.2.42 (official build))
, server ClickHouseNode [uri=http://localhost:32841/system, options={custom_settings=allow_experimental_object_type=1,insert_allow_materialized_columns=1,client_name=Client_1}]@2037727223
	at com.altinity.clickhouse.debezium.embedded.MySQLJsonIT.testMultipleDatabases(MySQLJsonIT.java:132)

Check failure on line 103 in sink-connector-lightweight/src/test/java/com/altinity/clickhouse/debezium/embedded/PostgresInitialDockerIT.java

See this annotation in the file changed.

@github-actions github-actions / JUnit Test Report

PostgresInitialDockerIT.testDecoderBufsPlugin

java.lang.AssertionError
	at com.altinity.clickhouse.debezium.embedded.PostgresInitialDockerIT.testDecoderBufsPlugin(PostgresInitialDockerIT.java:103)
Raw output
java.lang.AssertionError
	at com.altinity.clickhouse.debezium.embedded.PostgresInitialDockerIT.testDecoderBufsPlugin(PostgresInitialDockerIT.java:103)

Check failure on line 126 in sink-connector-lightweight/src/test/java/com/altinity/clickhouse/debezium/embedded/PostgresInitialDockerWKeeperMapStorageIT.java

See this annotation in the file changed.

@github-actions github-actions / JUnit Test Report

PostgresInitialDockerWKeeperMapStorageIT.testDecoderBufsPlugin

java.lang.AssertionError
	at com.altinity.clickhouse.debezium.embedded.PostgresInitialDockerWKeeperMapStorageIT.testDecoderBufsPlugin(PostgresInitialDockerWKeeperMapStorageIT.java:126)
Raw output
java.lang.AssertionError
	at com.altinity.clickhouse.debezium.embedded.PostgresInitialDockerWKeeperMapStorageIT.testDecoderBufsPlugin(PostgresInitialDockerWKeeperMapStorageIT.java:126)

Check failure on line 116 in sink-connector-lightweight/src/test/java/com/altinity/clickhouse/debezium/embedded/PostgresPgoutputMultipleSchemaIT.java

See this annotation in the file changed.

@github-actions github-actions / JUnit Test Report

PostgresPgoutputMultipleSchemaIT.testMultipleSchemaReplication

java.lang.AssertionError
	at com.altinity.clickhouse.debezium.embedded.PostgresPgoutputMultipleSchemaIT.testMultipleSchemaReplication(PostgresPgoutputMultipleSchemaIT.java:116)
Raw output
java.lang.AssertionError
	at com.altinity.clickhouse.debezium.embedded.PostgresPgoutputMultipleSchemaIT.testMultipleSchemaReplication(PostgresPgoutputMultipleSchemaIT.java:116)

Check failure on line 110 in sink-connector-lightweight/src/test/java/com/altinity/clickhouse/debezium/embedded/ReplicatedRMTClickHouse22TIT.java

See this annotation in the file changed.

@github-actions github-actions / JUnit Test Report

ReplicatedRMTClickHouse22TIT.testReplicatedRMTAutoCreate{String}[1]

Code: 390. DB::Exception: Table `string_types_MEDIUMTEXT_utf8mb4` doesn't exist. (CANNOT_GET_CREATE_TABLE_QUERY) (version 22.3.20.29 (official build))
, server ClickHouseNode [uri=http://localhost:32790/employees, options={custom_settings=allow_experimental_object_type=1,insert_allow_materialized_columns=1,client_name=client_1}]@-1765198060
Raw output
java.sql.BatchUpdateException: 
Code: 390. DB::Exception: Table `string_types_MEDIUMTEXT_utf8mb4` doesn't exist. (CANNOT_GET_CREATE_TABLE_QUERY) (version 22.3.20.29 (official build))
, server ClickHouseNode [uri=http://localhost:32790/employees, options={custom_settings=allow_experimental_object_type=1,insert_allow_materialized_columns=1,client_name=client_1}]@-1765198060
	at com.altinity.clickhouse.debezium.embedded.ReplicatedRMTClickHouse22TIT.testReplicatedRMTAutoCreate(ReplicatedRMTClickHouse22TIT.java:110)

Check failure on line 112 in sink-connector-lightweight/src/test/java/com/altinity/clickhouse/debezium/embedded/ReplicatedRMTDDLClickHouse22TIT.java

See this annotation in the file changed.

@github-actions github-actions / JUnit Test Report

ReplicatedRMTDDLClickHouse22TIT.testReplicatedRMTAutoCreate{String}[1]

Code: 390. DB::Exception: Table `string_types_MEDIUMTEXT_utf8mb4` doesn't exist. (CANNOT_GET_CREATE_TABLE_QUERY) (version 22.3.20.29 (official build))
, server ClickHouseNode [uri=http://localhost:32780/employees, options={custom_settings=allow_experimental_object_type=1,insert_allow_materialized_columns=1,client_name=client_1}]@199936990
Raw output
java.sql.BatchUpdateException: 
Code: 390. DB::Exception: Table `string_types_MEDIUMTEXT_utf8mb4` doesn't exist. (CANNOT_GET_CREATE_TABLE_QUERY) (version 22.3.20.29 (official build))
, server ClickHouseNode [uri=http://localhost:32780/employees, options={custom_settings=allow_experimental_object_type=1,insert_allow_materialized_columns=1,client_name=client_1}]@199936990
	at com.altinity.clickhouse.debezium.embedded.ReplicatedRMTDDLClickHouse22TIT.testReplicatedRMTAutoCreate(ReplicatedRMTDDLClickHouse22TIT.java:112)

Check failure on line 115 in sink-connector-lightweight/src/test/java/com/altinity/clickhouse/debezium/embedded/ReplicatedRMTDDLIT.java

See this annotation in the file changed.

@github-actions github-actions / JUnit Test Report

ReplicatedRMTDDLIT.testReplicatedRMTAutoCreate{String}[1]

Code: 390. DB::Exception: Table `string_types_MEDIUMTEXT_utf8mb4` doesn't exist. (CANNOT_GET_CREATE_TABLE_QUERY) (version 24.9.2.42 (official build))
, server ClickHouseNode [uri=http://localhost:32783/employees, options={custom_settings=allow_experimental_object_type=1,insert_allow_materialized_columns=1,client_name=client_1}]@-389603525
Raw output
java.sql.BatchUpdateException: 
Code: 390. DB::Exception: Table `string_types_MEDIUMTEXT_utf8mb4` doesn't exist. (CANNOT_GET_CREATE_TABLE_QUERY) (version 24.9.2.42 (official build))
, server ClickHouseNode [uri=http://localhost:32783/employees, options={custom_settings=allow_experimental_object_type=1,insert_allow_materialized_columns=1,client_name=client_1}]@-389603525
	at com.altinity.clickhouse.debezium.embedded.ReplicatedRMTDDLIT.testReplicatedRMTAutoCreate(ReplicatedRMTDDLIT.java:115)

Check failure on line 58 in sink-connector-lightweight/src/test/java/com/altinity/clickhouse/debezium/embedded/ReplicatedRMTIT.java

See this annotation in the file changed.

@github-actions github-actions / JUnit Test Report

ReplicatedRMTIT.testReplicatedRMTAutoCreate{String}[1]

Container startup failed for image docker.io/bitnami/mysql:8.0.36
Raw output
org.testcontainers.containers.ContainerLaunchException: Container startup failed for image docker.io/bitnami/mysql:8.0.36
	at com.altinity.clickhouse.debezium.embedded.ReplicatedRMTIT.startContainers(ReplicatedRMTIT.java:58)
Caused by: org.rnorth.ducttape.RetryCountExceededException: Retry limit hit with exception
	at com.altinity.clickhouse.debezium.embedded.ReplicatedRMTIT.startContainers(ReplicatedRMTIT.java:58)
Caused by: org.testcontainers.containers.ContainerLaunchException: Could not create/start container
	at com.altinity.clickhouse.debezium.embedded.ReplicatedRMTIT.startContainers(ReplicatedRMTIT.java:58)
Caused by: java.lang.IllegalStateException: Wait strategy failed. Container exited with code 1
	at com.altinity.clickhouse.debezium.embedded.ReplicatedRMTIT.startContainers(ReplicatedRMTIT.java:58)
Caused by: java.lang.IllegalStateException: Container is started, but cannot be accessed by (JDBC URL: jdbc:mysql://localhost:32857/employees), please check container logs
	at com.altinity.clickhouse.debezium.embedded.ReplicatedRMTIT.startContainers(ReplicatedRMTIT.java:58)
Caused by: java.sql.SQLException: Could not create new connection
	at com.altinity.clickhouse.debezium.embedded.ReplicatedRMTIT.startContainers(ReplicatedRMTIT.java:58)
Caused by: com.mysql.cj.jdbc.exceptions.CommunicationsException: 
Communications link failure

The last packet sent successfully to the server was 0 milliseconds ago. The driver has not received any packets from the server.
	at com.altinity.clickhouse.debezium.embedded.ReplicatedRMTIT.startContainers(ReplicatedRMTIT.java:58)
Caused by: com.mysql.cj.exceptions.CJCommunicationsException: 
Communications link failure

The last packet sent successfully to the server was 0 milliseconds ago. The driver has not received any packets from the server.
	at com.altinity.clickhouse.debezium.embedded.ReplicatedRMTIT.startContainers(ReplicatedRMTIT.java:58)
Caused by: java.io.EOFException: Can not read response from server. Expected to read 4 bytes, read 0 bytes before connection was unexpectedly lost.
	at com.altinity.clickhouse.debezium.embedded.ReplicatedRMTIT.startContainers(ReplicatedRMTIT.java:58)

Check failure on line 128 in sink-connector-lightweight/src/test/java/com/altinity/clickhouse/debezium/embedded/cdc/DatabaseOverrideIT.java

See this annotation in the file changed.

@github-actions github-actions / JUnit Test Report

DatabaseOverrideIT.testDatabaseOverride

Code: 81. DB::Exception: Database employees2 does not exist. Maybe you meant employees?. (UNKNOWN_DATABASE) (version 24.9.2.42 (official build))
, server ClickHouseNode [uri=http://localhost:32832/system, options={custom_settings=allow_experimental_object_type=1,insert_allow_materialized_columns=1,client_name=Client_1}]@-488618528
Raw output
java.sql.BatchUpdateException: 
Code: 81. DB::Exception: Database employees2 does not exist. Maybe you meant employees?. (UNKNOWN_DATABASE) (version 24.9.2.42 (official build))
, server ClickHouseNode [uri=http://localhost:32832/system, options={custom_settings=allow_experimental_object_type=1,insert_allow_materialized_columns=1,client_name=Client_1}]@-488618528
	at com.altinity.clickhouse.debezium.embedded.cdc.DatabaseOverrideIT.testDatabaseOverride(DatabaseOverrideIT.java:128)

Check failure on line 112 in sink-connector-lightweight/src/test/java/com/altinity/clickhouse/debezium/embedded/cdc/DatabaseOverrideInitialIT.java

See this annotation in the file changed.

@github-actions github-actions / JUnit Test Report

DatabaseOverrideInitialIT.testDatabaseOverride

Code: 81. DB::Exception: Database employees2 does not exist. (UNKNOWN_DATABASE) (version 24.9.2.42 (official build))
, server ClickHouseNode [uri=http://localhost:32830/system, options={custom_settings=allow_experimental_object_type=1,insert_allow_materialized_columns=1,client_name=Client_1}]@-95591518
Raw output
java.sql.BatchUpdateException: 
Code: 81. DB::Exception: Database employees2 does not exist. (UNKNOWN_DATABASE) (version 24.9.2.42 (official build))
, server ClickHouseNode [uri=http://localhost:32830/system, options={custom_settings=allow_experimental_object_type=1,insert_allow_materialized_columns=1,client_name=Client_1}]@-95591518
	at com.altinity.clickhouse.debezium.embedded.cdc.DatabaseOverrideInitialIT.testDatabaseOverride(DatabaseOverrideInitialIT.java:112)

Check failure on line 167 in sink-connector-lightweight/src/test/java/com/altinity/clickhouse/debezium/embedded/cdc/DebeziumChangeEventCaptureIT.java

See this annotation in the file changed.

@github-actions github-actions / JUnit Test Report

DebeziumChangeEventCaptureIT.testIncrementingSequenceNumbers

Code: 60. DB::Exception: Unknown table expression identifier 'newtable' in scope SELECT _version FROM newtable FINAL WHERE col1 = 'a'. (UNKNOWN_TABLE) (version 24.9.2.42 (official build))
, server ClickHouseNode [uri=http://localhost:32833/employees, options={custom_settings=allow_experimental_object_type=1,insert_allow_materialized_columns=1,client_name=Client_1}]@-1551340759
Raw output
java.sql.BatchUpdateException: 
Code: 60. DB::Exception: Unknown table expression identifier 'newtable' in scope SELECT _version FROM newtable FINAL WHERE col1 = 'a'. (UNKNOWN_TABLE) (version 24.9.2.42 (official build))
, server ClickHouseNode [uri=http://localhost:32833/employees, options={custom_settings=allow_experimental_object_type=1,insert_allow_materialized_columns=1,client_name=Client_1}]@-1551340759
	at com.altinity.clickhouse.debezium.embedded.cdc.DebeziumChangeEventCaptureIT.testIncrementingSequenceNumbers(DebeziumChangeEventCaptureIT.java:167)

Check failure on line 97 in sink-connector-lightweight/src/test/java/com/altinity/clickhouse/debezium/embedded/cdc/DebeziumStorageViewIT.java

See this annotation in the file changed.

@github-actions github-actions / JUnit Test Report

DebeziumStorageViewIT.debeziumStorageView

Code: 390. DB::Exception: Table `show_replica_status` doesn't exist. (CANNOT_GET_CREATE_TABLE_QUERY) (version 24.9.2.42 (official build))
, server ClickHouseNode [uri=http://localhost:32823/altinity_sink_connector, options={custom_settings=allow_experimental_object_type=1,insert_allow_materialized_columns=1,client_name=Client_1}]@1906136656
Raw output
java.sql.BatchUpdateException: 
Code: 390. DB::Exception: Table `show_replica_status` doesn't exist. (CANNOT_GET_CREATE_TABLE_QUERY) (version 24.9.2.42 (official build))
, server ClickHouseNode [uri=http://localhost:32823/altinity_sink_connector, options={custom_settings=allow_experimental_object_type=1,insert_allow_materialized_columns=1,client_name=Client_1}]@1906136656
	at com.altinity.clickhouse.debezium.embedded.cdc.DebeziumStorageViewIT.debeziumStorageView(DebeziumStorageViewIT.java:97)

Check failure on line 140 in sink-connector-lightweight/src/test/java/com/altinity/clickhouse/debezium/embedded/cdc/MultipleUpdatesWSameTimestampIT.java

See this annotation in the file changed.

@github-actions github-actions / JUnit Test Report

MultipleUpdatesWSameTimestampIT.testIncrementingSequenceNumberWithUpdates

Code: 60. DB::Exception: Unknown table expression identifier 'newtable' in scope SELECT col2 FROM newtable FINAL WHERE col1 = 'a'. (UNKNOWN_TABLE) (version 24.9.2.42 (official build))
, server ClickHouseNode [uri=http://localhost:32825/employees, options={custom_settings=allow_experimental_object_type=1,insert_allow_materialized_columns=1,client_name=Client_1}]@20767281
Raw output
java.sql.BatchUpdateException: 
Code: 60. DB::Exception: Unknown table expression identifier 'newtable' in scope SELECT col2 FROM newtable FINAL WHERE col1 = 'a'. (UNKNOWN_TABLE) (version 24.9.2.42 (official build))
, server ClickHouseNode [uri=http://localhost:32825/employees, options={custom_settings=allow_experimental_object_type=1,insert_allow_materialized_columns=1,client_name=Client_1}]@20767281
	at com.altinity.clickhouse.debezium.embedded.cdc.MultipleUpdatesWSameTimestampIT.testIncrementingSequenceNumberWithUpdates(MultipleUpdatesWSameTimestampIT.java:140)

Check failure on line 122 in sink-connector-lightweight/src/test/java/com/altinity/clickhouse/debezium/embedded/cdc/SourceDBColumnMissingIT.java

See this annotation in the file changed.

@github-actions github-actions / JUnit Test Report

SourceDBColumnMissingIT.testColumnMismatch

Cannot invoke "io.debezium.engine.DebeziumEngine.close()" because "com.altinity.clickhouse.debezium.embedded.ClickHouseDebeziumEmbeddedApplication.getDebeziumEventCapture().engine" is null
Raw output
java.lang.NullPointerException: Cannot invoke "io.debezium.engine.DebeziumEngine.close()" because "com.altinity.clickhouse.debezium.embedded.ClickHouseDebeziumEmbeddedApplication.getDebeziumEventCapture().engine" is null
	at com.altinity.clickhouse.debezium.embedded.cdc.SourceDBColumnMissingIT.testColumnMismatch(SourceDBColumnMissingIT.java:122)

Check failure on line 95 in sink-connector-lightweight/src/test/java/com/altinity/clickhouse/debezium/embedded/ddl/parser/AlterTableAddColumnIT.java

See this annotation in the file changed.

@github-actions github-actions / JUnit Test Report

AlterTableAddColumnIT.testAddColumn

Cannot invoke "String.equalsIgnoreCase(String)" because the return value of "java.util.Map.get(Object)" is null
Raw output
java.lang.NullPointerException: Cannot invoke "String.equalsIgnoreCase(String)" because the return value of "java.util.Map.get(Object)" is null
	at com.altinity.clickhouse.debezium.embedded.ddl.parser.AlterTableAddColumnIT.testAddColumn(AlterTableAddColumnIT.java:95)

Check failure on line 87 in sink-connector-lightweight/src/test/java/com/altinity/clickhouse/debezium/embedded/ddl/parser/AlterTableChangeColumnIT.java

See this annotation in the file changed.

@github-actions github-actions / JUnit Test Report

AlterTableChangeColumnIT.testChangeColumn

Cannot invoke "String.equalsIgnoreCase(String)" because the return value of "java.util.Map.get(Object)" is null
Raw output
java.lang.NullPointerException: Cannot invoke "String.equalsIgnoreCase(String)" because the return value of "java.util.Map.get(Object)" is null
	at com.altinity.clickhouse.debezium.embedded.ddl.parser.AlterTableChangeColumnIT.testChangeColumn(AlterTableChangeColumnIT.java:87)

Check failure on line 81 in sink-connector-lightweight/src/test/java/com/altinity/clickhouse/debezium/embedded/ddl/parser/AlterTableModifyColumnIT.java

See this annotation in the file changed.

@github-actions github-actions / JUnit Test Report

AlterTableModifyColumnIT.testModifyColumn

Cannot invoke "String.equalsIgnoreCase(String)" because the return value of "java.util.Map.get(Object)" is null
Raw output
java.lang.NullPointerException: Cannot invoke "String.equalsIgnoreCase(String)" because the return value of "java.util.Map.get(Object)" is null
	at com.altinity.clickhouse.debezium.embedded.ddl.parser.AlterTableModifyColumnIT.testModifyColumn(AlterTableModifyColumnIT.java:81)

Check failure on line 104 in sink-connector-lightweight/src/test/java/com/altinity/clickhouse/debezium/embedded/ddl/parser/AutoCreateTableIT.java

See this annotation in the file changed.

@github-actions github-actions / JUnit Test Report

AutoCreateTableIT.testAutoCreateTable{String}[1]

Code: 60. DB::Exception: Unknown table expression identifier 'new-table' in scope SELECT count(*) FROM `new-table`. (UNKNOWN_TABLE) (version 24.9.2.42 (official build))
, server ClickHouseNode [uri=http://localhost:32804/employees, options={custom_settings=allow_experimental_object_type=1,insert_allow_materialized_columns=1,client_name=Client_1}]@-147416410
Raw output
java.sql.BatchUpdateException: 
Code: 60. DB::Exception: Unknown table expression identifier 'new-table' in scope SELECT count(*) FROM `new-table`. (UNKNOWN_TABLE) (version 24.9.2.42 (official build))
, server ClickHouseNode [uri=http://localhost:32804/employees, options={custom_settings=allow_experimental_object_type=1,insert_allow_materialized_columns=1,client_name=Client_1}]@-147416410
	at com.altinity.clickhouse.debezium.embedded.ddl.parser.AutoCreateTableIT.testAutoCreateTable(AutoCreateTableIT.java:104)

Check failure on line 104 in sink-connector-lightweight/src/test/java/com/altinity/clickhouse/debezium/embedded/ddl/parser/AutoCreateTableIT.java

See this annotation in the file changed.

@github-actions github-actions / JUnit Test Report

AutoCreateTableIT.testAutoCreateTable{String}[2]

Code: 60. DB::Exception: Unknown table expression identifier 'new-table' in scope SELECT count(*) FROM `new-table`. (UNKNOWN_TABLE) (version 24.9.2.42 (official build))
, server ClickHouseNode [uri=http://localhost:32804/employees, options={custom_settings=allow_experimental_object_type=1,insert_allow_materialized_columns=1,client_name=Client_1}]@-147416410
Raw output
java.sql.BatchUpdateException: 
Code: 60. DB::Exception: Unknown table expression identifier 'new-table' in scope SELECT count(*) FROM `new-table`. (UNKNOWN_TABLE) (version 24.9.2.42 (official build))
, server ClickHouseNode [uri=http://localhost:32804/employees, options={custom_settings=allow_experimental_object_type=1,insert_allow_materialized_columns=1,client_name=Client_1}]@-147416410
	at com.altinity.clickhouse.debezium.embedded.ddl.parser.AutoCreateTableIT.testAutoCreateTable(AutoCreateTableIT.java:104)

Check failure on line 86 in sink-connector-lightweight/src/test/java/com/altinity/clickhouse/debezium/embedded/ddl/parser/CreateTableDataTypesIT.java

See this annotation in the file changed.

@github-actions github-actions / JUnit Test Report

CreateTableDataTypesIT.testCreateTable

Cannot invoke "String.equalsIgnoreCase(String)" because the return value of "java.util.Map.get(Object)" is null
Raw output
java.lang.NullPointerException: Cannot invoke "String.equalsIgnoreCase(String)" because the return value of "java.util.Map.get(Object)" is null
	at com.altinity.clickhouse.debezium.embedded.ddl.parser.CreateTableDataTypesIT.testCreateTable(CreateTableDataTypesIT.java:86)

Check failure on line 95 in sink-connector-lightweight/src/test/java/com/altinity/clickhouse/debezium/embedded/ddl/parser/CreateTableDataTypesTimeZoneIT.java

See this annotation in the file changed.

@github-actions github-actions / JUnit Test Report

CreateTableDataTypesTimeZoneIT.testCreateTable

Cannot invoke "String.equalsIgnoreCase(String)" because the return value of "java.util.Map.get(Object)" is null
Raw output
java.lang.NullPointerException: Cannot invoke "String.equalsIgnoreCase(String)" because the return value of "java.util.Map.get(Object)" is null
	at com.altinity.clickhouse.debezium.embedded.ddl.parser.CreateTableDataTypesTimeZoneIT.testCreateTable(CreateTableDataTypesTimeZoneIT.java:95)